Reaction Details
TargetSodium-dependent dopamine transporter
LigandBDBM50243501
Substrate/Competitorn/a
Meas. Tech.ChEMBL_487432 (CHEMBL1020887)
Ki 45±n/a nM
Citation Mahaney, PEGavrin, LKTrybulski, EJStack, GPVu, TACohn, STYe, FBelardi, JKSantilli, AASabatucci, JPLeiter, JJohnston, GHBray, JABurroughs, KDCosmi, SALeventhal, LKoury, EJZhang, YMugford, CAHo, DMRosenzweig-Lipson, SJPlatt, BSmith, VADeecher, DC Structure-activity relationships of the cycloalkanol ethylamine scaffold: discovery of selective norepinephrine reuptake inhibitors. J Med Chem51:4038-49 (2008) 
 
Sodium-dependent dopamine transporter
Name:Sodium-dependent dopamine transporter
Type:Multi-pass membrane protein
Mol. Mass.:68497.11
Organism:Homo sapiens (Human)
Description:Q01959
Residue:620
BDBM50243501
NameBDBM50243501
Synonyms:1-[1-(3-Chlorophenyl)-2-piperazin-1-ylethyl]cyclohexanol Dihydrochloride | CHEMBL461705
TypeSmall organic molecule
Emp. Form.C18H27ClN2O
Mol. Mass.322.873
SMILESOC1(CCCCC1)C(CN1CCNCC1)c1cccc(Cl)c1