Reaction Details
TargetAdenosine receptor A2a
LigandBDBM50243661
Substrate/Competitorn/a
Meas. Tech.ChEMBL_491362 (CHEMBL986416)
Ki 1.1±n/a nM
Citation Shah, ULankin, CMBoyle, CDChackalamannil, SGreenlee, WJNeustadt, BRCohen-Williams, MEHiggins, GANg, KVarty, GBZhang, HLachowicz, JE Design, synthesis, and evaluation of fused heterocyclic analogs of SCH 58261 as adenosine A2A receptor antagonists. Bioorg Med Chem Lett18:4204-9 (2008) 
 
Adenosine receptor A2a
Name:Adenosine receptor A2a
Type:G Protein-Coupled Receptor (GPCR)
Mol. Mass.:44716.46
Organism:Homo sapiens (Human)
Description:P29274
Residue:412
BDBM50243661
NameBDBM50243661
Synonyms:7-[2-(7-Bromo-1,2,4,5-tetrahydro-benzo[d]azepin-3-yl)-ethyl]-2-furan-2-yl-7H-pyrazolo[4,3-e][1,2,4]triazolo[1,5-c]pyrimidin-5-ylamine | CHEMBL472112
TypeSmall organic molecule
Emp. Form.C22H21BrN8O
Mol. Mass.493.359
SMILESNc1nc2n(CCN3CCc4ccc(Br)cc4CC3)ncc2c2nc(nn12)-c1ccco1