Reaction Details
TargetAdenosine receptor A2a
LigandBDBM50243660
Substrate/Competitorn/a
Meas. Tech.ChEMBL_491362 (CHEMBL986416)
Ki 0.7±n/a nM
Citation Shah, ULankin, CMBoyle, CDChackalamannil, SGreenlee, WJNeustadt, BRCohen-Williams, MEHiggins, GANg, KVarty, GBZhang, HLachowicz, JE Design, synthesis, and evaluation of fused heterocyclic analogs of SCH 58261 as adenosine A2A receptor antagonists. Bioorg Med Chem Lett18:4204-9 (2008) 
 
Adenosine receptor A2a
Name:Adenosine receptor A2a
Type:G Protein-Coupled Receptor (GPCR)
Mol. Mass.:44716.46
Organism:Homo sapiens (Human)
Description:P29274
Residue:412
BDBM50243660
NameBDBM50243660
Synonyms:2-Furan-2-yl-7-[2-(7-nitro-1,2,4,5-tetrahydro-benzo[d]azepin-3-yl)-ethyl]-7H-pyrazolo[4,3-e][1,2,4]triazolo[1,5-c]pyrimidin-5-ylamine | CHEMBL472111
TypeSmall organic molecule
Emp. Form.C22H21N9O3
Mol. Mass.459.4606
SMILESNc1nc2n(CCN3CCc4ccc(cc4CC3)[N+]([O-])=O)ncc2c2nc(nn12)-c1ccco1