Reaction Details
TargetAdenosine receptor A2a
LigandBDBM50252164
Substrate/Competitorn/a
Meas. Tech.ChEMBL_491756 (CHEMBL937827)
Ki 2.8±n/a nM
Citation Shah, UBoyle, CDChackalamannil, SNeustadt, BRLindo, NGreenlee, WJFoster, CArik, LZhai, YNg, KWang, SMonopoli, ALachowicz, JE Biaryl and heteroaryl derivatives of SCH 58261 as potent and selective adenosine A2A receptor antagonists. Bioorg Med Chem Lett18:4199-203 (2008) 
 
Adenosine receptor A2a
Name:Adenosine receptor A2a
Type:G Protein-Coupled Receptor (GPCR)
Mol. Mass.:44716.46
Organism:Homo sapiens (Human)
Description:P29274
Residue:412
BDBM50252164
NameBDBM50252164
Synonyms:2-Furan-2-yl-7-{2-[2-(2-methoxy-ethoxymethyl)-quinolin-6-yl]-ethyl}-7H-pyrazolo[4,3-e][1,2,4]triazolo[1,5-c]pyrimidin-5-ylamine | CHEMBL480177
TypeSmall organic molecule
Emp. Form.C25H24N8O3
Mol. Mass.484.5099
SMILESCOCCOCc1ccc2cc(CCn3ncc4c3nc(N)n3nc(nc43)-c3ccco3)ccc2n1