Reaction Details
TargetAdenosine receptor A2a
LigandBDBM50252163
Substrate/Competitorn/a
Meas. Tech.ChEMBL_491756 (CHEMBL937827)
Ki 2.7±n/a nM
Citation Shah, UBoyle, CDChackalamannil, SNeustadt, BRLindo, NGreenlee, WJFoster, CArik, LZhai, YNg, KWang, SMonopoli, ALachowicz, JE Biaryl and heteroaryl derivatives of SCH 58261 as potent and selective adenosine A2A receptor antagonists. Bioorg Med Chem Lett18:4199-203 (2008) 
 
Adenosine receptor A2a
Name:Adenosine receptor A2a
Type:G Protein-Coupled Receptor (GPCR)
Mol. Mass.:44716.46
Organism:Homo sapiens (Human)
Description:P29274
Residue:412
BDBM50252163
NameBDBM50252163
Synonyms:7-[2-(2-Ethyl-quinolin-6-yl)-ethyl]-2-furan-2-yl-7H-pyrazolo[4,3-e][1,2,4]triazolo[1,5-c]pyrimidin-5-ylamine | CHEMBL481956
TypeSmall organic molecule
Emp. Form.C23H20N8O
Mol. Mass.424.4579
SMILESCCc1ccc2cc(CCn3ncc4c5nc(nn5c(N)nc34)-c3ccco3)ccc2n1