Reaction Details
TargetDipeptidyl peptidase 4
LigandBDBM50210653
Substrate/Competitorn/a
Meas. Tech.ChEMBL_490313 (CHEMBL981107)
IC50 151±n/a nM
Citation Hagmann, WK The many roles for fluorine in medicinal chemistry. J Med Chem51:4359-69 (2008) 
 
Dipeptidyl peptidase 4
Name:Dipeptidyl peptidase 4
Type:Enzyme
Mol. Mass.:88271.01
Organism:Homo sapiens (Human)
Description:P27487
Residue:766
BDBM50210653
NameBDBM50210653
Synonyms:(R)-3-amino-1-(3-(trifluoromethyl)-5,6-dihydro-[1,2,4]triazolo[4,3-a]pyrazin-7(8H)-yl)-4-(2,3,6-trifluorophenyl)butan-1-one | CHEMBL394833
TypeSmall organic molecule
Emp. Form.C16H15F6N5O
Mol. Mass.407.3136
SMILESN[C@@H](CC(=O)N1CCn2c(C1)nnc2C(F)(F)F)Cc1c(F)ccc(F)c1F