Reaction Details
TargetCannabinoid receptor 1
LigandBDBM50200838
Substrate/Competitorn/a
Meas. Tech.ChEMBL_490321 (CHEMBL981115)
IC50 2.03±n/a nM
Citation Hagmann, WK The many roles for fluorine in medicinal chemistry. J Med Chem51:4359-69 (2008) 
 
Cannabinoid receptor 1
Name:Cannabinoid receptor 1
Type:G Protein-Coupled Receptor (GPCR)
Mol. Mass.:52868.96
Organism:Homo sapiens (Human)
Description:P21554
Residue:472
BDBM50200838
NameBDBM50200838
Synonyms:CHEMBL217862 N-[(1S,2S)-3-(4-chlorophenyl)-1-methyl-2-phenylpropyl]-2-(phenyloxy)-2-methylpropanamide
TypeSmall organic molecule
Emp. Form.C26H28ClNO2
Mol. Mass.421.959
SMILESC[C@H](NC(=O)C(C)(C)Oc1ccccc1)[C@@H](Cc1ccc(Cl)cc1)c1ccccc1