Reaction Details
TargetProstaglandin D2 receptor
LigandBDBM50251428
Substrate/Competitorn/a
Meas. Tech.ChEMBL_490322 (CHEMBL981116)
Ki 1.1±n/a nM
Citation Hagmann, WK The many roles for fluorine in medicinal chemistry. J Med Chem51:4359-69 (2008) 
 
Prostaglandin D2 receptor
Name:Prostaglandin D2 receptor
Type:Enzyme
Mol. Mass.:40288.87
Organism:Homo sapiens (Human)
Description:Q13258
Residue:359
BDBM50251428
NameBDBM50251428
Synonyms:2-(4-(4-chlorobenzyl)-5-acetyl-7-fluoro-1,2,3,4-tetrahydrocyclopenta[b]indol-3-yl)acetic acid | CHEMBL518461
TypeSmall organic molecule
Emp. Form.C22H19ClFNO3
Mol. Mass.399.843
SMILESCC(=O)c1cc(F)cc2c3CCC(CC(O)=O)c3n(Cc3ccc(Cl)cc3)c12