Reaction Details
TargetProthrombin
LigandBDBM50251416
Substrate/Competitorn/a
Meas. Tech.ChEMBL_490330 (CHEMBL982027)
Ki 360±n/a nM
Citation Hagmann, WK The many roles for fluorine in medicinal chemistry. J Med Chem51:4359-69 (2008) 
 
Prothrombin
Name:Prothrombin
Type:Protein
Mol. Mass.:70029.57
Organism:Homo sapiens (Human)
Description:P00734
Residue:622
BDBM50251416
NameBDBM50251416
Synonyms:4-[(R)-2-(3-Fluoro-benzyl)-1,3-dioxo-decahydro-pyrrolo[3,4-a]pyrrolizin-4-yl]-benzamidine; hydrochloride | CHEMBL479743
TypeSmall organic molecule
Emp. Form.C23H23FN4O2
Mol. Mass.406.4527
SMILESNC(=N)c1ccc(cc1)[C@H]1C2C(C3CCCN13)C(=O)N(Cc1cccc(F)c1)C2=O