Reaction Details
TargetAndrogen receptor
LigandBDBM50252450
Substrate/Competitorn/a
Meas. Tech.ChEMBL_487546 (CHEMBL1013140)
Ki 340±n/a nM
Citation Wakabayashi, KImai, KMiyachi, HHashimoto, YTanatani, A 4-(Anilino)pyrrole-2-carboxamides: Novel non-steroidal/non-anilide type androgen antagonists effective upon human prostate tumor LNCaP cells with mutated nuclear androgen receptor. Bioorg Med Chem16:6799-812 (2008) 
 
Androgen receptor
Name:Androgen receptor
Type:Receptor
Mol. Mass.:99185.27
Organism:Homo sapiens (Human)
Description:CHO cells were stably transfected with human AR gene.
Residue:920
BDBM50252450
NameBDBM50252450
Synonyms:CHEMBL482063 | N-[4-[(Benzyl)(4-nitrophenyl)amino]phenylcarbonyl]pyrrolidine
TypeSmall organic molecule
Emp. Form.C24H23N3O3
Mol. Mass.401.4577
SMILES[O-][N+](=O)c1ccc(cc1)N(Cc1ccccc1)c1ccc(cc1)C(=O)N1CCCC1