Reaction Details
TargetAndrogen receptor
LigandBDBM50252331
Substrate/Competitorn/a
Meas. Tech.ChEMBL_487546 (CHEMBL1013140)
Ki 170±n/a nM
Citation Wakabayashi, KImai, KMiyachi, HHashimoto, YTanatani, A 4-(Anilino)pyrrole-2-carboxamides: Novel non-steroidal/non-anilide type androgen antagonists effective upon human prostate tumor LNCaP cells with mutated nuclear androgen receptor. Bioorg Med Chem16:6799-812 (2008) 
 
Androgen receptor
Name:Androgen receptor
Type:Receptor
Mol. Mass.:99185.27
Organism:Homo sapiens (Human)
Description:CHO cells were stably transfected with human AR gene.
Residue:920
BDBM50252331
NameBDBM50252331
Synonyms:4-[(Benzyl)(4-nitrophenyl)amino]-2-hydroxymethyl-1-methylpyrrole | CHEMBL480960
TypeSmall organic molecule
Emp. Form.C19H19N3O3
Mol. Mass.337.3725
SMILESCn1cc(cc1CO)N(Cc1ccccc1)c1ccc(cc1)[N+]([O-])=O