Reaction Details
TargetAndrogen receptor
LigandBDBM50252173
Substrate/Competitorn/a
Meas. Tech.ChEMBL_487546 (CHEMBL1013140)
Ki 2000±n/a nM
Citation Wakabayashi, KImai, KMiyachi, HHashimoto, YTanatani, A 4-(Anilino)pyrrole-2-carboxamides: Novel non-steroidal/non-anilide type androgen antagonists effective upon human prostate tumor LNCaP cells with mutated nuclear androgen receptor. Bioorg Med Chem16:6799-812 (2008) 
 
Androgen receptor
Name:Androgen receptor
Type:Receptor
Mol. Mass.:99185.27
Organism:Homo sapiens (Human)
Description:CHO cells were stably transfected with human AR gene.
Residue:920
BDBM50252173
NameBDBM50252173
Synonyms:CHEMBL481355 | N-[4-[(Ethyl)(4-nitrophenyl)amino]-1-methylpyrrole-2-carbonyl]pyrrolidine
TypeSmall organic molecule
Emp. Form.C18H22N4O3
Mol. Mass.342.3923
SMILESCCN(c1cc(C(=O)N2CCCC2)n(C)c1)c1ccc(cc1)[N+]([O-])=O