Reaction Details
TargetAndrogen receptor
LigandBDBM50252125
Substrate/Competitorn/a
Meas. Tech.ChEMBL_487546 (CHEMBL1013140)
Ki 690±n/a nM
Citation Wakabayashi, KImai, KMiyachi, HHashimoto, YTanatani, A 4-(Anilino)pyrrole-2-carboxamides: Novel non-steroidal/non-anilide type androgen antagonists effective upon human prostate tumor LNCaP cells with mutated nuclear androgen receptor. Bioorg Med Chem16:6799-812 (2008) 
 
Androgen receptor
Name:Androgen receptor
Type:Receptor
Mol. Mass.:99185.27
Organism:Homo sapiens (Human)
Description:CHO cells were stably transfected with human AR gene.
Residue:920
BDBM50252125
NameBDBM50252125
Synonyms:CHEMBL481515 | N-[4-[(3,5-Dimethylphenyl)(4-hydroxyphenyl)amino]-1-methylpyrrole-2-carbonyl]pyrrolidine
TypeSmall organic molecule
Emp. Form.C25H29N3O2
Mol. Mass.403.5167
SMILESCc1cc(C)cc(c1)N(Cc1ccc(O)cc1)c1cc(C(=O)N2CCCC2)n(C)c1