Reaction Details
TargetAndrogen receptor
LigandBDBM50252079
Substrate/Competitorn/a
Meas. Tech.ChEMBL_487546 (CHEMBL1013140)
Ki 2700±n/a nM
Citation Wakabayashi, KImai, KMiyachi, HHashimoto, YTanatani, A 4-(Anilino)pyrrole-2-carboxamides: Novel non-steroidal/non-anilide type androgen antagonists effective upon human prostate tumor LNCaP cells with mutated nuclear androgen receptor. Bioorg Med Chem16:6799-812 (2008) 
 
Androgen receptor
Name:Androgen receptor
Type:Receptor
Mol. Mass.:99185.27
Organism:Homo sapiens (Human)
Description:CHO cells were stably transfected with human AR gene.
Residue:920
BDBM50252079
NameBDBM50252079
Synonyms:CHEMBL481152 | N-[4-[(3,5-Dimethylphenyl)(ethyl)amino]-1-methylpyrrole-2-carbonyl]pyrrolidine
TypeSmall organic molecule
Emp. Form.C20H27N3O
Mol. Mass.325.4479
SMILESCCN(c1cc(C(=O)N2CCCC2)n(C)c1)c1cc(C)cc(C)c1