Reaction Details
TargetAndrogen receptor
LigandBDBM18678
Substrate/Competitorn/a
Meas. Tech.ChEMBL_487550 (CHEMBL1013144)
IC50 270±n/a nM
Citation Wakabayashi, KImai, KMiyachi, HHashimoto, YTanatani, A 4-(Anilino)pyrrole-2-carboxamides: Novel non-steroidal/non-anilide type androgen antagonists effective upon human prostate tumor LNCaP cells with mutated nuclear androgen receptor. Bioorg Med Chem16:6799-812 (2008) 
 
Androgen receptor
Name:Androgen receptor
Type:Receptor
Mol. Mass.:99185.27
Organism:Homo sapiens (Human)
Description:CHO cells were stably transfected with human AR gene.
Residue:920
BDBM18678
NameBDBM18678
Synonyms:(2R)-N-[4-cyano-3-(trifluoromethyl)phenyl]-3-[(4-fluorobenzene)sulfonyl]-2-hydroxy-2-methylpropanamide CHEMBL63560 US11230523, Compound R-Bicalutamide US20230382870, (R) Bicalutumide
TypeSmall organic molecule
Emp. Form.C18H14F4N2O4S
Mol. Mass.430.373
SMILESC[C@](O)(CS(=O)(=O)c1ccc(F)cc1)C(=O)Nc1ccc(C#N)c(c1)C(F)(F)F