Reaction Details
TargetAndrogen receptor
LigandBDBM35909
Substrate/Competitorn/a
Meas. Tech.ChEMBL_487550 (CHEMBL1013144)
IC50 350±n/a nM
Citation Wakabayashi, KImai, KMiyachi, HHashimoto, YTanatani, A 4-(Anilino)pyrrole-2-carboxamides: Novel non-steroidal/non-anilide type androgen antagonists effective upon human prostate tumor LNCaP cells with mutated nuclear androgen receptor. Bioorg Med Chem16:6799-812 (2008) 
 
Androgen receptor
Name:Androgen receptor
Type:Receptor
Mol. Mass.:99185.27
Organism:Homo sapiens (Human)
Description:CHO cells were stably transfected with human AR gene.
Residue:920
BDBM35909
NameBDBM35909
Synonyms:2-Hydroxy-2-methyl-N-(4-nitro-3-trifluoromethyl-phenyl)-propionamide 2-Hydroxy-2-methyl-N-(4-nitro-3-trifluoromethyl-phenyl)-propionamide(Hydroxyflutamide) CHEMBL491 Hydroxyflutamide Sch 16423 cid_91649 | hydroxy-flutamide
TypeSmall organic molecule
Emp. Form.C11H11F3N2O4
Mol. Mass.292.2112
SMILESCC(C)(O)C(=O)Nc1ccc(c(c1)C(F)(F)F)[N+]([O-])=O