Reaction Details
TargetAndrogen receptor
LigandBDBM50252174
Substrate/Competitorn/a
Meas. Tech.ChEMBL_487550 (CHEMBL1013144)
IC50 14500±n/a nM
Citation Wakabayashi, KImai, KMiyachi, HHashimoto, YTanatani, A 4-(Anilino)pyrrole-2-carboxamides: Novel non-steroidal/non-anilide type androgen antagonists effective upon human prostate tumor LNCaP cells with mutated nuclear androgen receptor. Bioorg Med Chem16:6799-812 (2008) 
 
Androgen receptor
Name:Androgen receptor
Type:Receptor
Mol. Mass.:99185.27
Organism:Homo sapiens (Human)
Description:CHO cells were stably transfected with human AR gene.
Residue:920
BDBM50252174
NameBDBM50252174
Synonyms:CHEMBL481356 | N-[4-[(4-Nitrophenyl)(iso-propyl)amino]-1-methylpyrrole-2-carbonyl]pyrrolidine
TypeSmall organic molecule
Emp. Form.C19H24N4O3
Mol. Mass.356.4189
SMILESCC(C)N(c1cc(C(=O)N2CCCC2)n(C)c1)c1ccc(cc1)[N+]([O-])=O