Reaction Details
Target5-hydroxytryptamine receptor 1A
LigandBDBM86708
Substrate/Competitorn/a
Meas. Tech.ChEMBL_487560 (CHEMBL1013154)
Ki 0.9±n/a nM
Citation Zhou, DZhou, PEvrard, DAMeagher, KWebb, MHarrison, BLHuryn, DMGolembieski, JHornby, GASchechter, LESmith, DLAndree, THMewshaw, RE Studies toward the discovery of the next generation of antidepressants. Part 6: Dual 5-HT1A receptor and serotonin transporter affinity within a class of arylpiperazinyl-cyclohexyl indole derivatives. Bioorg Med Chem16:6707-23 (2008) 
 
5-hydroxytryptamine receptor 1A
Name:5-hydroxytryptamine receptor 1A
Type:n/a
Mol. Mass.:46122.49
Organism:Homo sapiens (Human)
Description:n/a
Residue:422
BDBM86708
NameBDBM86708
Synonyms:CAS_146714-97-8 CHEMBL514874 NSC_104911 | WAY 100,635
TypeSmall organic molecule
Emp. Form.C25H34N4O2
Mol. Mass.422.5631
SMILESCOc1ccccc1N1CCN(CCN(C(=O)C2CCCCC2)c2ccccn2)CC1