Reaction Details
TargetInsulin-like growth factor 1 receptor
LigandBDBM50252304
Substrate/Competitorn/a
Meas. Tech.ChEMBL_487710 (CHEMBL1022735)
IC50 9±n/a nM
Citation Zimmermann, KWittman, MDSaulnier, MGVelaparthi, ULangley, DRSang, XFrennesson, DCarboni, JLi, AGreer, AGottardis, MAttar, RMYang, ZBalimane, PDiscenza, LNVyas, D Balancing oral exposure with Cyp3A4 inhibition in benzimidazole-based IGF-IR inhibitors. Bioorg Med Chem Lett18:4075-80 (2008) 
 
Insulin-like growth factor 1 receptor
Name:Insulin-like growth factor 1 receptor
Type:Protein
Mol. Mass.:154776.79
Organism:Homo sapiens (Human)
Description:P08069
Residue:1367
BDBM50252304
NameBDBM50252304
Synonyms:(S)-4-(2-(3-chlorophenyl)-2-hydroxyethylamino)-3-(4-methyl-6-(4-(4-(morpholine-4-carbonyl)piperazin-1-yl)piperidin-1-yl)-1H-benzo[d]imidazol-2-yl)pyridin-2(1H)-one | CHEMBL459118
TypeSmall organic molecule
Emp. Form.C35H43ClN8O4
Mol. Mass.675.22
SMILESCc1cc(cc2[nH]c(nc12)-c1c(NC[C@@H](O)c2cccc(Cl)c2)cc[nH]c1=O)N1CCC(CC1)N1CCN(CC1)C(=O)N1CCOCC1