Reaction Details
TargetInsulin-like growth factor 1 receptor
LigandBDBM50252297
Substrate/Competitorn/a
Meas. Tech.ChEMBL_487710 (CHEMBL1022735)
IC50 32±n/a nM
Citation Zimmermann, KWittman, MDSaulnier, MGVelaparthi, ULangley, DRSang, XFrennesson, DCarboni, JLi, AGreer, AGottardis, MAttar, RMYang, ZBalimane, PDiscenza, LNVyas, D Balancing oral exposure with Cyp3A4 inhibition in benzimidazole-based IGF-IR inhibitors. Bioorg Med Chem Lett18:4075-80 (2008) 
 
Insulin-like growth factor 1 receptor
Name:Insulin-like growth factor 1 receptor
Type:Protein
Mol. Mass.:154776.79
Organism:Homo sapiens (Human)
Description:P08069
Residue:1367
BDBM50252297
NameBDBM50252297
Synonyms:(S)-3-(6-(4-(4-acetylpiperazin-1-yl)piperidin-1-yl)-4-methyl-1H-benzo[d]imidazol-2-yl)-4-(2-(3-chlorophenyl)-2-hydroxyethylamino)pyridin-2(1H)-one | CHEMBL506169
TypeSmall organic molecule
Emp. Form.C32H38ClN7O3
Mol. Mass.604.142
SMILESCC(=O)N1CCN(CC1)C1CCN(CC1)c1cc(C)c2nc([nH]c2c1)-c1c(NC[C@@H](O)c2cccc(Cl)c2)cc[nH]c1=O