Reaction Details
TargetInsulin-like growth factor 1 receptor
LigandBDBM50252236
Substrate/Competitorn/a
Meas. Tech.ChEMBL_487710 (CHEMBL1022735)
IC50 50±n/a nM
Citation Zimmermann, KWittman, MDSaulnier, MGVelaparthi, ULangley, DRSang, XFrennesson, DCarboni, JLi, AGreer, AGottardis, MAttar, RMYang, ZBalimane, PDiscenza, LNVyas, D Balancing oral exposure with Cyp3A4 inhibition in benzimidazole-based IGF-IR inhibitors. Bioorg Med Chem Lett18:4075-80 (2008) 
 
Insulin-like growth factor 1 receptor
Name:Insulin-like growth factor 1 receptor
Type:Protein
Mol. Mass.:154776.79
Organism:Homo sapiens (Human)
Description:P08069
Residue:1367
BDBM50252236
NameBDBM50252236
Synonyms:(S)-N-(1-(2-(4-(2-(3-chlorophenyl)-2-hydroxyethylamino)-2-oxo-1,2-dihydropyridin-3-yl)-4-methyl-1H-benzo[d]imidazol-6-yl)piperidin-4-yl)cyclopropanecarboxamide CHEMBL480966
TypeSmall organic molecule
Emp. Form.C30H33ClN6O3
Mol. Mass.561.074
SMILESCc1cc(cc2[nH]c(nc12)-c1c(NC[C@@H](O)c2cccc(Cl)c2)cc[nH]c1=O)N1CCC(CC1)NC(=O)C1CC1