Reaction Details
TargetInsulin-like growth factor 1 receptor
LigandBDBM50252143
Substrate/Competitorn/a
Meas. Tech.ChEMBL_487711 (CHEMBL1022736)
IC50 99±n/a nM
Citation Zimmermann, KWittman, MDSaulnier, MGVelaparthi, ULangley, DRSang, XFrennesson, DCarboni, JLi, AGreer, AGottardis, MAttar, RMYang, ZBalimane, PDiscenza, LNVyas, D Balancing oral exposure with Cyp3A4 inhibition in benzimidazole-based IGF-IR inhibitors. Bioorg Med Chem Lett18:4075-80 (2008) 
 
Insulin-like growth factor 1 receptor
Name:Insulin-like growth factor 1 receptor
Type:PROTEIN
Mol. Mass.:155770.40
Organism:Mus musculus
Description:ChEMBL_820934
Residue:1373
BDBM50252143
NameBDBM50252143
Synonyms:(S)-4-(2-(3-chlorophenyl)-2-hydroxyethylamino)-3-(6-(4-(2-methoxyethoxy)piperidin-1-yl)-4-methyl-1H-benzo[d]imidazol-2-yl)pyridin-2(1H)-one | CHEMBL482088
TypeSmall organic molecule
Emp. Form.C29H34ClN5O4
Mol. Mass.552.064
SMILESCOCCOC1CCN(CC1)c1cc(C)c2nc([nH]c2c1)-c1c(NC[C@@H](O)c2cccc(Cl)c2)cc[nH]c1=O