Reaction Details
TargetCytochrome P450 3A4
LigandBDBM50252303
Substrate/Competitorn/a
Meas. Tech.ChEMBL_487712 (CHEMBL1022737)
IC50 1.8±n/a nM
Citation Zimmermann, KWittman, MDSaulnier, MGVelaparthi, ULangley, DRSang, XFrennesson, DCarboni, JLi, AGreer, AGottardis, MAttar, RMYang, ZBalimane, PDiscenza, LNVyas, D Balancing oral exposure with Cyp3A4 inhibition in benzimidazole-based IGF-IR inhibitors. Bioorg Med Chem Lett18:4075-80 (2008) 
 
Cytochrome P450 3A4
Name:Cytochrome P450 3A4
Type:Enzyme
Mol. Mass.:57349.57
Organism:Homo sapiens (Human)
Description:n/a
Residue:503
BDBM50252303
NameBDBM50252303
Synonyms:(S)-2-hydroxyethyl 4-(1-(2-(4-(2-(3-chlorophenyl)-2-hydroxyethylamino)-2-oxo-1,2-dihydropyridin-3-yl)-7-methyl-3H-benzo[d]imidazol-5-yl)piperidin-4-yl)piperazine-1-carboxylate | CHEMBL505652
TypeSmall organic molecule
Emp. Form.C33H40ClN7O5
Mol. Mass.650.168
SMILESCc1cc(cc2[nH]c(nc12)-c1c(NC[C@@H](O)c2cccc(Cl)c2)cc[nH]c1=O)N1CCC(CC1)N1CCN(CC1)C(=O)OCCO