Reaction Details
TargetCytochrome P450 3A4
LigandBDBM50252297
Substrate/Competitorn/a
Meas. Tech.ChEMBL_487712 (CHEMBL1022737)
IC50 0.8±n/a nM
Citation Zimmermann, KWittman, MDSaulnier, MGVelaparthi, ULangley, DRSang, XFrennesson, DCarboni, JLi, AGreer, AGottardis, MAttar, RMYang, ZBalimane, PDiscenza, LNVyas, D Balancing oral exposure with Cyp3A4 inhibition in benzimidazole-based IGF-IR inhibitors. Bioorg Med Chem Lett18:4075-80 (2008) 
 
Cytochrome P450 3A4
Name:Cytochrome P450 3A4
Type:Enzyme
Mol. Mass.:57349.57
Organism:Homo sapiens (Human)
Description:n/a
Residue:503
BDBM50252297
NameBDBM50252297
Synonyms:(S)-3-(6-(4-(4-acetylpiperazin-1-yl)piperidin-1-yl)-4-methyl-1H-benzo[d]imidazol-2-yl)-4-(2-(3-chlorophenyl)-2-hydroxyethylamino)pyridin-2(1H)-one | CHEMBL506169
TypeSmall organic molecule
Emp. Form.C32H38ClN7O3
Mol. Mass.604.142
SMILESCC(=O)N1CCN(CC1)C1CCN(CC1)c1cc(C)c2nc([nH]c2c1)-c1c(NC[C@@H](O)c2cccc(Cl)c2)cc[nH]c1=O