Reaction Details
TargetMu-type opioid receptor
LigandBDBM50166050
Substrate/Competitorn/a
Meas. Tech.ChEMBL_487719 (CHEMBL1022744)
Ki 2.4±n/a nM
Citation Keresztes, ASzucs, MBorics, AKövér, KEForró, EFülöp, FTömböly, CPéter, APáhi, AFábián, GMurányi, MTóth, G New endomorphin analogues containing alicyclic beta-amino acids: influence on bioactive conformation and pharmacological profile. J Med Chem51:4270-9 (2008) 
 
Mu-type opioid receptor
Name:Mu-type opioid receptor
Type:G Protein-Coupled Receptor (GPCR)
Mol. Mass.:44503.11
Organism:Rattus norvegicus (rat)
Description:Competition binding assays were carried out using membrane preparations from transfected HN9.10 cells that constitutively expressed the mu opioid receptor.
Residue:398
BDBM50166050
NameBDBM50166050
Synonyms:(1S,2R)-2-[2-Amino-3-((S)-4-hydroxy-phenyl)-propionylamino]-cyclopentanecarboxylic acid [(S)-1-((S)-1-carbamoyl-2-phenyl-ethylcarbamoyl)-2-phenyl-ethyl]-amide CHEMBL363787
TypeSmall organic molecule
Emp. Form.C33H39N5O5
Mol. Mass.585.6933
SMILESN[C@@H](Cc1ccc(O)cc1)C(=O)N[C@@H]1CCC[C@@H]1C(=O)N[C@@H](Cc1ccccc1)C(=O)N[C@@H](Cc1ccccc1)C(N)=O