Reaction Details
TargetMu-type opioid receptor
LigandBDBM50252412
Substrate/Competitorn/a
Meas. Tech.ChEMBL_487719 (CHEMBL1022744)
Ki 16±n/a nM
Citation Keresztes, ASzucs, MBorics, AKövér, KEForró, EFülöp, FTömböly, CPéter, APáhi, AFábián, GMurányi, MTóth, G New endomorphin analogues containing alicyclic beta-amino acids: influence on bioactive conformation and pharmacological profile. J Med Chem51:4270-9 (2008) 
 
Mu-type opioid receptor
Name:Mu-type opioid receptor
Type:G Protein-Coupled Receptor (GPCR)
Mol. Mass.:44503.11
Organism:Rattus norvegicus (rat)
Description:Competition binding assays were carried out using membrane preparations from transfected HN9.10 cells that constitutively expressed the mu opioid receptor.
Residue:398
BDBM50252412
NameBDBM50252412
Synonyms:(1R,2R)-N-((S)-1-((S)-1-amino-1-oxo-3-phenylpropan-2-ylamino)-3-(1H-indol-3-yl)-1-oxopropan-2-yl)-2-((S)-2-amino-3-(4-hydroxyphenyl)propanamido)cyclopentanecarboxamide | CHEMBL509619
TypeSmall organic molecule
Emp. Form.C35H40N6O5
Mol. Mass.624.7293
SMILESN[C@@H](Cc1ccc(O)cc1)C(=O)N[C@@H]1CCC[C@H]1C(=O)N[C@@H](Cc1c[nH]c2ccccc12)C(=O)N[C@@H](Cc1ccccc1)C(N)=O