Reaction Details
TargetDelta-type opioid receptor
LigandBDBM50252417
Substrate/Competitorn/a
Meas. Tech.ChEMBL_487721 (CHEMBL1009453)
Ki 4228±n/a nM
Citation Keresztes, ASzucs, MBorics, AKövér, KEForró, EFülöp, FTömböly, CPéter, APáhi, AFábián, GMurányi, MTóth, G New endomorphin analogues containing alicyclic beta-amino acids: influence on bioactive conformation and pharmacological profile. J Med Chem51:4270-9 (2008) 
 
Delta-type opioid receptor
Name:Delta-type opioid receptor
Type:G Protein-Coupled Receptor (GPCR)
Mol. Mass.:40465.04
Organism:Rattus norvegicus (rat)
Description:Competition binding assays were using CHO-K1 cell membranes expressing the opioid receptor.
Residue:372
BDBM50252417
NameBDBM50252417
Synonyms:(1S,2S)-N-((S)-1-((S)-1-amino-1-oxo-3-phenylpropan-2-ylamino)-1-oxo-3-phenylpropan-2-yl)-2-((S)-2-amino-3-(4-hydroxyphenyl)propanamido)cyclopentanecarboxamide | CHEMBL467089
TypeSmall organic molecule
Emp. Form.C33H39N5O5
Mol. Mass.585.6933
SMILESN[C@@H](Cc1ccc(O)cc1)C(=O)N[C@H]1CCC[C@@H]1C(=O)N[C@@H](Cc1ccccc1)C(=O)N[C@@H](Cc1ccccc1)C(N)=O