Reaction Details
TargetUrotensin-2 receptor
LigandBDBM50252311
Substrate/Competitorn/a
Meas. Tech.ChEMBL_487750 (CHEMBL1009482)
Ki 71±n/a nM
Citation Jin, JAn, MSapienza, AAiyar, NNaselsky, DSarau, HMFoley, JJSalyers, KLKnight, SDKeenan, RMRivero, RADhanak, DDouglas, SA Urotensin-II receptor antagonists: synthesis and SAR of N-cyclic azaalkyl benzamides. Bioorg Med Chem Lett18:3950-4 (2008) 
 
Urotensin-2 receptor
Name:Urotensin-2 receptor
Type:Enzyme Catalytic Domain
Mol. Mass.:42159.71
Organism:Homo sapiens (Human)
Description:Urotensin-II UTS2R HUMAN::Q9UKP6
Residue:389
BDBM50252311
NameBDBM50252311
Synonyms:(+/-)-N-(1-(3-bromo-4-(piperidin-4-yloxy)phenylsulfonyl)azepan-3-yl)-3,4-dichlorobenzamide | CHEMBL521117
TypeSmall organic molecule
Emp. Form.C24H28BrCl2N3O4S
Mol. Mass.605.372
SMILESClc1ccc(cc1Cl)C(=O)NC1CCCCN(C1)S(=O)(=O)c1ccc(OC2CCNCC2)c(Br)c1