Reaction Details
TargetUrotensin-2 receptor
LigandBDBM50252240
Substrate/Competitorn/a
Meas. Tech.ChEMBL_487750 (CHEMBL1009482)
Ki 69±n/a nM
Citation Jin, JAn, MSapienza, AAiyar, NNaselsky, DSarau, HMFoley, JJSalyers, KLKnight, SDKeenan, RMRivero, RADhanak, DDouglas, SA Urotensin-II receptor antagonists: synthesis and SAR of N-cyclic azaalkyl benzamides. Bioorg Med Chem Lett18:3950-4 (2008) 
 
Urotensin-2 receptor
Name:Urotensin-2 receptor
Type:Enzyme Catalytic Domain
Mol. Mass.:42159.71
Organism:Homo sapiens (Human)
Description:Urotensin-II UTS2R HUMAN::Q9UKP6
Residue:389
BDBM50252240
NameBDBM50252240
Synonyms:(S)-N-(1-(3-nitro-4-(piperidin-4-yloxy)phenethyl)pyrrolidin-3-yl)-3,4-dichlorobenzamide | CHEMBL482114
TypeSmall organic molecule
Emp. Form.C24H28Cl2N4O4
Mol. Mass.507.41
SMILES[O-][N+](=O)c1cc(CCN2CC[C@@H](C2)NC(=O)c2ccc(Cl)c(Cl)c2)ccc1OC1CCNCC1