Reaction Details
Target5-hydroxytryptamine receptor 1A
LigandBDBM50252659
Substrate/Competitorn/a
Meas. Tech.ChEMBL_487756 (CHEMBL1009488)
Ki 38±n/a nM
Citation Jin, JAn, MSapienza, AAiyar, NNaselsky, DSarau, HMFoley, JJSalyers, KLKnight, SDKeenan, RMRivero, RADhanak, DDouglas, SA Urotensin-II receptor antagonists: synthesis and SAR of N-cyclic azaalkyl benzamides. Bioorg Med Chem Lett18:3950-4 (2008) 
 
5-hydroxytryptamine receptor 1A
Name:5-hydroxytryptamine receptor 1A
Type:n/a
Mol. Mass.:46122.49
Organism:Homo sapiens (Human)
Description:n/a
Residue:422
BDBM50252659
NameBDBM50252659
Synonyms:(S)-N-(1-(3-bromo-4-(piperidin-4-yloxy)benzyl)pyrrolidin-3-yl)-3,4-dichlorobenzamide | CHEMBL495075
TypeSmall organic molecule
Emp. Form.C23H26BrCl2N3O2
Mol. Mass.527.281
SMILESClc1ccc(cc1Cl)C(=O)N[C@H]1CCN(Cc2ccc(OC3CCNCC3)c(Br)c2)C1