Reaction Details
TargetCentromere-associated protein E
LigandBDBM50252149
Substrate/Competitorn/a
Meas. Tech.ChEMBL_487863 (CHEMBL1020049)
IC50>50000±n/a nM
Citation Cox, CDColeman, PJBreslin, MJWhitman, DBGarbaccio, RMFraley, MEBuser, CAWalsh, ESHamilton, KSchaber, MDLobell, RBTao, WDavide, JPDiehl, REAbrams, MTSouth, VJHuber, HETorrent, MPrueksaritanont, TLi, CSlaughter, DEMahan, EFernandez-Metzler, CYan, YKuo, LCKohl, NEHartman, GD Kinesin spindle protein (KSP) inhibitors. 9. Discovery of (2S)-4-(2,5-difluorophenyl)-n-[(3R,4S)-3-fluoro-1-methylpiperidin-4-yl]-2-(hydroxymethyl)-N-methyl-2-phenyl-2,5-dihydro-1H-pyrrole-1-carboxamide (MK-0731) for the treatment of taxane-refractory cancer. J Med Chem51:4239-52 (2008) 
 
Centromere-associated protein E
Name:Centromere-associated protein E
Type:PROTEIN
Mol. Mass.:316360.15
Organism:Homo sapiens (Human)
Description:ChEMBL_976960
Residue:2701
BDBM50252149
NameBDBM50252149
Synonyms:(2S)-4-(2,5-difluorophenyl)-N-[(3R,4S)-3-fluoro-1-methylpiperidin-4-yl]-2-(hydroxymethyl)-N-methyl-2-phenyl-2,5-dihydro-1H-pyrrole-1-carboxamide CHEMBL481931 | MK-0731
TypeSmall organic molecule
Emp. Form.C25H28F3N3O2
Mol. Mass.459.5039
SMILESCN([C@H]1CCN(C)C[C@H]1F)C(=O)N1CC(=C[C@@]1(CO)c1ccccc1)c1cc(F)ccc1F