Reaction Details
TargetEgl nine homolog 1
LigandBDBM50251958
Substrate/Competitorn/a
Meas. Tech.ChEMBL_488018 (CHEMBL983035)
IC50 11±n/a nM
Citation Tegley, CMViswanadhan, VNBiswas, KFrohn, MJPeterkin, TAChang, CBürli, RWDao, JHVeith, HRogers, NYoder, SCBiddlecome, GTagari, PAllen, JRHungate, RW Discovery of novel hydroxy-thiazoles as HIF-alpha prolyl hydroxylase inhibitors: SAR, synthesis, and modeling evaluation. Bioorg Med Chem Lett18:3925-8 (2008) 
 
Egl nine homolog 1
Name:Egl nine homolog 1
Type:Protein
Mol. Mass.:46035.59
Organism:Homo sapiens (Human)
Description:Q9GZT9
Residue:426
BDBM50251958
NameBDBM50251958
Synonyms:2-(2-(2-(benzylsulfonyl)acetamido)-3-hydroxy-2,3-dihydrothiazol-4-yl)acetic acid | CHEMBL481692
TypeSmall organic molecule
Emp. Form.C14H14N2O6S2
Mol. Mass.370.401
SMILESOC(=O)Cc1csc(=NC(=O)CS(=O)(=O)Cc2ccccc2)n1O