Reaction Details
TargetAurora kinase A
LigandBDBM50251961
Substrate/Competitorn/a
Meas. Tech.ChEMBL_488023 (CHEMBL983040)
IC50>100000±n/a nM
Citation Cancilla, MTHe, MMViswanathan, NSimmons, RLTaylor, MFung, ADCao, KErlanson, DA Discovery of an Aurora kinase inhibitor through site-specific dynamic combinatorial chemistry. Bioorg Med Chem Lett18:3978-81 (2008) 
 
Aurora kinase A
Name:Aurora kinase A
Type:Serine/threonine-protein kinase
Mol. Mass.:45830.98
Organism:Homo sapiens (Human)
Description:O14965
Residue:403
BDBM50251961
NameBDBM50251961
Synonyms:CHEMBL449217 | N-hexyl-9H-purin-6-amine
TypeSmall organic molecule
Emp. Form.C11H17N5
Mol. Mass.219.2862
SMILESCCCCCCNc1ncnc2nc[nH]c12