Reaction Details
TargetAcetylcholinesterase
LigandBDBM10624
Substrate/Competitorn/a
Meas. Tech.ChEMBL_490564 (CHEMBL981170)
IC50 8±n/a nM
Citation Leonetti, FCatto, MNicolotti, OPisani, LCappa, AStefanachi, ACarotti, A Homo- and hetero-bivalent edrophonium-like ammonium salts as highly potent, dual binding site AChE inhibitors. Bioorg Med Chem16:7450-6 (2008) 
 
Acetylcholinesterase
Name:Acetylcholinesterase
Type:Enzyme
Mol. Mass.:67659.62
Organism:Bos taurus (bovine)
Description:n/a
Residue:613
BDBM10624
NameBDBM10624
Synonyms:1,5-bis(4-allyldimethylammoniumphenyl)-pentan-3-one dibromide BW284c51 CHEMBL464538
TypeSmall organic molecule
Emp. Form.C27H38N2O
Mol. Mass.406.6023
SMILESC[N+](C)(CC=C)c1ccc(CCC(=O)CCc2ccc(cc2)[N+](C)(C)CC=C)cc1