Reaction Details
TargetLysine--tRNA ligase
LigandBDBM50249539
Substrate/Competitorn/a
Meas. Tech.ChEMBL_490569 (CHEMBL981176)
IC50 4±n/a nM
Citation Hirabayashi, AMukaiyama, HKobayashi, HShiohara, HNakayama, SOzawa, MMiyazawa, KMisawa, KOhnota, HIsaji, M A novel Syk family kinase inhibitor: design, synthesis, and structure-activity relationship of 1,2,4-triazolo[4,3-c]pyrimidine and 1,2,4-triazolo[1,5-c]pyrimidine derivatives. Bioorg Med Chem16:7347-57 (2008) 
 
Lysine--tRNA ligase
Name:Lysine--tRNA ligase
Type:PROTEIN
Mol. Mass.:68044.78
Organism:Homo sapiens (Human)
Description:ChEMBL_960665
Residue:597
BDBM50249539
NameBDBM50249539
Synonyms:5-((1S,2R)-2-aminocyclohexylamino)-7-(3,5-dimethoxyphenylamino)-[1,2,4]triazolo[1,5-c]pyrimidine-8-carboxamide CHEMBL475575 | cis-5-(2-Aminocyclohexylamino)-7-(3,5-dimethoxyphenylamino)-1,2,4-triazolo[1,5-c]pyrimidine-8-carboxamide
TypeSmall organic molecule
Emp. Form.C20H26N8O3
Mol. Mass.426.4722
SMILESCOc1cc(Nc2nc(N[C@H]3CCCC[C@H]3N)n3ncnc3c2C(N)=O)cc(OC)c1