Reaction Details
TargetTyrosine-protein kinase ZAP-70
LigandBDBM50263120
Substrate/Competitorn/a
Meas. Tech.ChEMBL_490570 (CHEMBL981177)
IC50 120±n/a nM
Citation Hirabayashi, AMukaiyama, HKobayashi, HShiohara, HNakayama, SOzawa, MMiyazawa, KMisawa, KOhnota, HIsaji, M A novel Syk family kinase inhibitor: design, synthesis, and structure-activity relationship of 1,2,4-triazolo[4,3-c]pyrimidine and 1,2,4-triazolo[1,5-c]pyrimidine derivatives. Bioorg Med Chem16:7347-57 (2008) 
 
Tyrosine-protein kinase ZAP-70
Name:Tyrosine-protein kinase ZAP-70
Type:Enzyme
Mol. Mass.:69881.61
Organism:Homo sapiens (Human)
Description:ZAP-70 SH2 domain was expressed and purified from E. coli using O-phospho-L-tyrosine-agarose column.
Residue:619
BDBM50263120
NameBDBM50263120
Synonyms:CHEMBL475882 | cis-5-(2-Aminocyclohexylamino)-7-(3,5-dimethoxyphenylamino)-2-(3-methoxyphenyl)-1,2,4-triazolo[1,5-c]-pyrimidine-8-carboxamide
TypeSmall organic molecule
Emp. Form.C27H32N8O4
Mol. Mass.532.5942
SMILESCOc1cccc(c1)-c1nc2c(C(N)=O)c(Nc3cc(OC)cc(OC)c3)nc(N[C@H]3CCCC[C@H]3N)n2n1