Reaction Details
TargetPoly [ADP-ribose] polymerase 1
LigandBDBM50251545
Substrate/Competitorn/a
Meas. Tech.ChEMBL_488104 (CHEMBL986586)
Ki 41±n/a nM
Citation Zhu, GDGandhi, VBGong, JThomas, SLuo, YLiu, XShi, YKlinghofer, VJohnson, EFFrost, DDonawho, CJarvis, KBouska, JMarsh, KCRosenberg, SHGiranda, VLPenning, TD Synthesis and SAR of novel, potent and orally bioavailable benzimidazole inhibitors of poly(ADP-ribose) polymerase (PARP) with a quaternary methylene-amino substituent. Bioorg Med Chem Lett18:3955-8 (2008) 
 
Poly [ADP-ribose] polymerase 1
Name:Poly [ADP-ribose] polymerase 1
Type:n/a
Mol. Mass.:113114.22
Organism:Homo sapiens (Human)
Description:P09874
Residue:1014
BDBM50251545
NameBDBM50251545
Synonyms:2-(1-(propylamino)ethyl)-1H-benzo[d]imidazole-4-carboxamide | CHEMBL480198
TypeSmall organic molecule
Emp. Form.C13H18N4O
Mol. Mass.246.3082
SMILESCCCNC(C)c1nc2cccc(C(N)=O)c2[nH]1