Reaction Details
TargetPoly [ADP-ribose] polymerase 1
LigandBDBM50251581
Substrate/Competitorn/a
Meas. Tech.ChEMBL_488104 (CHEMBL986586)
Ki 140±n/a nM
Citation Zhu, GDGandhi, VBGong, JThomas, SLuo, YLiu, XShi, YKlinghofer, VJohnson, EFFrost, DDonawho, CJarvis, KBouska, JMarsh, KCRosenberg, SHGiranda, VLPenning, TD Synthesis and SAR of novel, potent and orally bioavailable benzimidazole inhibitors of poly(ADP-ribose) polymerase (PARP) with a quaternary methylene-amino substituent. Bioorg Med Chem Lett18:3955-8 (2008) 
 
Poly [ADP-ribose] polymerase 1
Name:Poly [ADP-ribose] polymerase 1
Type:n/a
Mol. Mass.:113114.22
Organism:Homo sapiens (Human)
Description:P09874
Residue:1014
BDBM50251581
NameBDBM50251581
Synonyms:2-(1-{[(dimethylamino)sulfonyl]amino}ethyl)-1H-benzimidazole-4-carboxamide | CHEMBL481096
TypeSmall organic molecule
Emp. Form.C12H17N5O3S
Mol. Mass.311.36
SMILESCC(NS(=O)(=O)N(C)C)c1nc2c(cccc2[nH]1)C(N)=O