Reaction Details
TargetPoly [ADP-ribose] polymerase 1
LigandBDBM27088
Substrate/Competitorn/a
Meas. Tech.ChEMBL_488104 (CHEMBL986586)
Ki 240±n/a nM
Citation Zhu, GDGandhi, VBGong, JThomas, SLuo, YLiu, XShi, YKlinghofer, VJohnson, EFFrost, DDonawho, CJarvis, KBouska, JMarsh, KCRosenberg, SHGiranda, VLPenning, TD Synthesis and SAR of novel, potent and orally bioavailable benzimidazole inhibitors of poly(ADP-ribose) polymerase (PARP) with a quaternary methylene-amino substituent. Bioorg Med Chem Lett18:3955-8 (2008) 
 
Poly [ADP-ribose] polymerase 1
Name:Poly [ADP-ribose] polymerase 1
Type:n/a
Mol. Mass.:113114.22
Organism:Homo sapiens (Human)
Description:P09874
Residue:1014
BDBM27088
NameBDBM27088
Synonyms:1H-1,3-benzodiazole-4-carboxamide CHEMBL133694
TypeSmall organic molecule
Emp. Form.C8H7N3O
Mol. Mass.161.1607
SMILESNC(=O)c1cccc2nc[nH]c12