Reaction Details
TargetProgesterone receptor
LigandBDBM50251799
Substrate/Competitorn/a
Meas. Tech.ChEMBL_488146 (CHEMBL987437)
IC50 150±n/a nM
Citation Nakagawa, AUno, SMakishima, MMiyachi, HHashimoto, Y Progesterone receptor antagonists with a 3-phenylquinazoline-2,4-dione/2-phenylisoquinoline-1,3-dione skeleton. Bioorg Med Chem16:7046-54 (2008) 
 
Progesterone receptor
Name:Progesterone receptor
Type:Protein
Mol. Mass.:98979.52
Organism:Homo sapiens (Human)
Description:P06401
Residue:933
BDBM50251799
NameBDBM50251799
Synonyms:4-(4,4-Diallyl-3,4-dihydro-1,3-dioxoisoquinolin-2(1H)-yl)benzonitrile | CHEMBL518464
TypeSmall organic molecule
Emp. Form.C22H18N2O2
Mol. Mass.342.3905
SMILESC=CCC1(CC=C)C(=O)N(C(=O)c2ccccc12)c1ccc(cc1)C#N