Reaction Details
TargetProgesterone receptor
LigandBDBM50251769
Substrate/Competitorn/a
Meas. Tech.ChEMBL_488146 (CHEMBL987437)
IC50 280±n/a nM
Citation Nakagawa, AUno, SMakishima, MMiyachi, HHashimoto, Y Progesterone receptor antagonists with a 3-phenylquinazoline-2,4-dione/2-phenylisoquinoline-1,3-dione skeleton. Bioorg Med Chem16:7046-54 (2008) 
 
Progesterone receptor
Name:Progesterone receptor
Type:Protein
Mol. Mass.:98979.52
Organism:Homo sapiens (Human)
Description:P06401
Residue:933
BDBM50251769
NameBDBM50251769
Synonyms:2-(4-Chlorophenyl)-4,4-diethylisoquinoline-1,3(2H,4H)-DIONE | CHEMBL479961
TypeSmall organic molecule
Emp. Form.C19H18ClNO2
Mol. Mass.327.805
SMILESCCC1(CC)C(=O)N(C(=O)c2ccccc12)c1ccc(Cl)cc1