Reaction Details
TargetProgesterone receptor
LigandBDBM50251798
Substrate/Competitorn/a
Meas. Tech.ChEMBL_488147 (CHEMBL990108)
IC50 120±n/a nM
Citation Nakagawa, AUno, SMakishima, MMiyachi, HHashimoto, Y Progesterone receptor antagonists with a 3-phenylquinazoline-2,4-dione/2-phenylisoquinoline-1,3-dione skeleton. Bioorg Med Chem16:7046-54 (2008) 
 
Progesterone receptor
Name:Progesterone receptor
Type:Protein
Mol. Mass.:98979.52
Organism:Homo sapiens (Human)
Description:P06401
Residue:933
BDBM50251798
NameBDBM50251798
Synonyms:4-(3,4-Dihydro-1,3-dioxo-4,4-dipropylisoquinolin-2(1H)-yl)benzonitrile | CHEMBL481144
TypeSmall organic molecule
Emp. Form.C22H22N2O2
Mol. Mass.346.4223
SMILESCCCC1(CCC)C(=O)N(C(=O)c2ccccc12)c1ccc(cc1)C#N