Reaction Details
TargetC5a anaphylatoxin chemotactic receptor 1
LigandBDBM50251714
Substrate/Competitorn/a
Meas. Tech.ChEMBL_488511 (CHEMBL991044)
IC50 140±n/a nM
Citation Gong, YBarbay, JKBuntinx, MLi, JWauwe, JVClaes, CLommen, GVHornby, PJHe, W Design and optimization of aniline-substituted tetrahydroquinoline C5a receptor antagonists. Bioorg Med Chem Lett18:3852-5 (2008) 
 
C5a anaphylatoxin chemotactic receptor 1
Name:C5a anaphylatoxin chemotactic receptor 1
Type:Enzyme
Mol. Mass.:39347.68
Organism:Homo sapiens (Human)
Description:P21730
Residue:350
BDBM50251714
NameBDBM50251714
Synonyms:2-(2,6-diethylphenyl)-4-methoxy-N-(5-methoxy-2-methylphenyl)-5,6,7,8-tetrahydroquinolin-5-amine | CHEMBL481482
TypeSmall organic molecule
Emp. Form.C28H34N2O2
Mol. Mass.430.5818
SMILESCCc1cccc(CC)c1-c1cc(OC)c2C(CCCc2n1)Nc1cc(OC)ccc1C