Reaction Details
TargetC5a anaphylatoxin chemotactic receptor 1
LigandBDBM50251712
Substrate/Competitorn/a
Meas. Tech.ChEMBL_488511 (CHEMBL991044)
IC50 2500±n/a nM
Citation Gong, YBarbay, JKBuntinx, MLi, JWauwe, JVClaes, CLommen, GVHornby, PJHe, W Design and optimization of aniline-substituted tetrahydroquinoline C5a receptor antagonists. Bioorg Med Chem Lett18:3852-5 (2008) 
 
C5a anaphylatoxin chemotactic receptor 1
Name:C5a anaphylatoxin chemotactic receptor 1
Type:Enzyme
Mol. Mass.:39347.68
Organism:Homo sapiens (Human)
Description:P21730
Residue:350
BDBM50251712
NameBDBM50251712
Synonyms:CHEMBL479392 | [2-(2,6-Diethyl-phenyl)-4-methoxy-5,6,7,8-tetrahydro-quinolin-5-yl]-(4-methyl-biphenyl-3-yl)-amine
TypeSmall organic molecule
Emp. Form.C33H36N2O
Mol. Mass.476.6517
SMILESCCc1cccc(CC)c1-c1cc(OC)c2C(CCCc2n1)Nc1cc(ccc1C)-c1ccccc1