Reaction Details
TargetC5a anaphylatoxin chemotactic receptor 1
LigandBDBM50251425
Substrate/Competitorn/a
Meas. Tech.ChEMBL_488511 (CHEMBL991044)
IC50 30±n/a nM
Citation Gong, YBarbay, JKBuntinx, MLi, JWauwe, JVClaes, CLommen, GVHornby, PJHe, W Design and optimization of aniline-substituted tetrahydroquinoline C5a receptor antagonists. Bioorg Med Chem Lett18:3852-5 (2008) 
 
C5a anaphylatoxin chemotactic receptor 1
Name:C5a anaphylatoxin chemotactic receptor 1
Type:Enzyme
Mol. Mass.:39347.68
Organism:Homo sapiens (Human)
Description:P21730
Residue:350
BDBM50251425
NameBDBM50251425
Synonyms:2-(2-(2-(2,6-diethylphenyl)-4-methoxy-5,6,7,8-tetrahydroquinolin-5-ylamino)phenyl)ethanol | CHEMBL480723
TypeSmall organic molecule
Emp. Form.C28H34N2O2
Mol. Mass.430.5818
SMILESCCc1cccc(CC)c1-c1cc(OC)c2C(CCCc2n1)Nc1ccccc1CCO