Reaction Details
TargetC5a anaphylatoxin chemotactic receptor 1
LigandBDBM50251673
Substrate/Competitorn/a
Meas. Tech.ChEMBL_488511 (CHEMBL991044)
IC50>10000±n/a nM
Citation Gong, YBarbay, JKBuntinx, MLi, JWauwe, JVClaes, CLommen, GVHornby, PJHe, W Design and optimization of aniline-substituted tetrahydroquinoline C5a receptor antagonists. Bioorg Med Chem Lett18:3852-5 (2008) 
 
C5a anaphylatoxin chemotactic receptor 1
Name:C5a anaphylatoxin chemotactic receptor 1
Type:Enzyme
Mol. Mass.:39347.68
Organism:Homo sapiens (Human)
Description:P21730
Residue:350
BDBM50251673
NameBDBM50251673
Synonyms:(+/-)-N,2-bis(2,6-dimethylphenyl)-4-methoxy-N-methyl-5,6,7,8-tetrahydroquinolin-5-amine | CHEMBL479766
TypeSmall organic molecule
Emp. Form.C27H32N2O
Mol. Mass.400.5558
SMILESCOc1cc(nc2CCCC(N(C)c3c(C)cccc3C)c12)-c1c(C)cccc1C