Reaction Details
TargetC5a anaphylatoxin chemotactic receptor 1
LigandBDBM50251462
Substrate/Competitorn/a
Meas. Tech.ChEMBL_488511 (CHEMBL991044)
IC50 340±n/a nM
Citation Gong, YBarbay, JKBuntinx, MLi, JWauwe, JVClaes, CLommen, GVHornby, PJHe, W Design and optimization of aniline-substituted tetrahydroquinoline C5a receptor antagonists. Bioorg Med Chem Lett18:3852-5 (2008) 
 
C5a anaphylatoxin chemotactic receptor 1
Name:C5a anaphylatoxin chemotactic receptor 1
Type:Enzyme
Mol. Mass.:39347.68
Organism:Homo sapiens (Human)
Description:P21730
Residue:350
BDBM50251462
NameBDBM50251462
Synonyms:2-(2,6-diethylphenyl)-4-methoxy-5-(5-methoxy-2-methylphenoxy)-5,6,7,8-tetrahydroquinoline | CHEMBL479558
TypeSmall organic molecule
Emp. Form.C28H33NO3
Mol. Mass.431.5665
SMILESCCc1cccc(CC)c1-c1cc(OC)c2C(CCCc2n1)Oc1cc(OC)ccc1C