Reaction Details
TargetC5a anaphylatoxin chemotactic receptor 1
LigandBDBM50251785
Substrate/Competitorn/a
Meas. Tech.ChEMBL_488511 (CHEMBL991044)
IC50 730±n/a nM
Citation Gong, YBarbay, JKBuntinx, MLi, JWauwe, JVClaes, CLommen, GVHornby, PJHe, W Design and optimization of aniline-substituted tetrahydroquinoline C5a receptor antagonists. Bioorg Med Chem Lett18:3852-5 (2008) 
 
C5a anaphylatoxin chemotactic receptor 1
Name:C5a anaphylatoxin chemotactic receptor 1
Type:Enzyme
Mol. Mass.:39347.68
Organism:Homo sapiens (Human)
Description:P21730
Residue:350
BDBM50251785
NameBDBM50251785
Synonyms:2-(2,6-diethylphenyl)-N-(2-ethylphenyl)-4-methoxy-5,6,7,8-tetrahydroquinolin-5-amine | CHEMBL479540
TypeSmall organic molecule
Emp. Form.C28H34N2O
Mol. Mass.414.5824
SMILESCCc1ccccc1NC1CCCc2nc(cc(OC)c12)-c1c(CC)cccc1CC