Reaction Details
TargetC5a anaphylatoxin chemotactic receptor 1
LigandBDBM50251813
Substrate/Competitorn/a
Meas. Tech.ChEMBL_488511 (CHEMBL991044)
IC50>10000±n/a nM
Citation Gong, YBarbay, JKBuntinx, MLi, JWauwe, JVClaes, CLommen, GVHornby, PJHe, W Design and optimization of aniline-substituted tetrahydroquinoline C5a receptor antagonists. Bioorg Med Chem Lett18:3852-5 (2008) 
 
C5a anaphylatoxin chemotactic receptor 1
Name:C5a anaphylatoxin chemotactic receptor 1
Type:Enzyme
Mol. Mass.:39347.68
Organism:Homo sapiens (Human)
Description:P21730
Residue:350
BDBM50251813
NameBDBM50251813
Synonyms:CHEMBL480947 | methyl 2-(2-(2,6-diethylphenyl)-4-methoxy-5,6,7,8-tetrahydroquinolin-5-ylamino)benzoate
TypeSmall organic molecule
Emp. Form.C28H32N2O3
Mol. Mass.444.5653
SMILESCCc1cccc(CC)c1-c1cc(OC)c2C(CCCc2n1)Nc1ccccc1C(=O)OC