Reaction Details
TargetC5a anaphylatoxin chemotactic receptor 1
LigandBDBM50251782
Substrate/Competitorn/a
Meas. Tech.ChEMBL_488511 (CHEMBL991044)
IC50 420±n/a nM
Citation Gong, YBarbay, JKBuntinx, MLi, JWauwe, JVClaes, CLommen, GVHornby, PJHe, W Design and optimization of aniline-substituted tetrahydroquinoline C5a receptor antagonists. Bioorg Med Chem Lett18:3852-5 (2008) 
 
C5a anaphylatoxin chemotactic receptor 1
Name:C5a anaphylatoxin chemotactic receptor 1
Type:Enzyme
Mol. Mass.:39347.68
Organism:Homo sapiens (Human)
Description:P21730
Residue:350
BDBM50251782
NameBDBM50251782
Synonyms:2-(2,6-diethylphenyl)-N-(2,5-dimethoxyphenyl)-4-methoxy-5,6,7,8-tetrahydroquinolin-5-amine | CHEMBL472136
TypeSmall organic molecule
Emp. Form.C28H34N2O3
Mol. Mass.446.5812
SMILESCCc1cccc(CC)c1-c1cc(OC)c2C(CCCc2n1)Nc1cc(OC)ccc1OC